Reaction Details
Target3-oxo-5-alpha-steroid 4-dehydrogenase 2
LigandBDBM50407317
Substrate/Competitorn/a
Meas. Tech.ChEMBL_204747 (CHEMBL805440)
Ki 38±n/a nM
Citation Holt, DAYamashita, DSKonialian-Beck, ALLuengo, JIAbell, ADBergsma, DJBrandt, MLevy, MA Benzophenone- and indolecarboxylic acids: potent type-2 specific inhibitors of human steroid 5 alpha-reductase. J Med Chem38:13-5 (1995) 3-oxo-5-alpha-steroid 4-dehydrogenase 2
Name:3-oxo-5-alpha-steroid 4-dehydrogenase 2
Type:Enzyme
Mol. Mass.:28406.59
Organism:Homo sapiens (Human)
Description:P31213
Residue:254
BDBM50407317
NameBDBM50407317
Synonyms:CHEMBL36022
TypeSmall organic molecule
Emp. Form.C22H13F3O4
Mol. Mass.398.3314
SMILESOC(=O)c1ccc(cc1)C(=O)c1ccc(cc1)C(=O)c1cccc(c1)C(F)(F)F