Reaction Details
TargetCholecystokinin receptor type A
LigandBDBM81962
Substrate/Competitorn/a
Meas. Tech.ChEMBL_49895 (CHEMBL661737)
IC50 158±n/a nM
Citation Sugg, EEKimery, MJDing, JMKenakin, DCMiller, LJQueen, KLRimele, TJ CCK-A receptor selective antagonists derived from the CCK-A receptor selective tetrapeptide agonist Boc-Trp-Lys(Tac)-Asp-MePhe-NH2 (A-71623). J Med Chem38:207-11 (1995) Cholecystokinin receptor type A
Name:Cholecystokinin receptor type A
Type:G Protein-Coupled Receptor (GPCR)
Mol. Mass.:47859.34
Organism:Homo sapiens (Human)
Description:Stable expression of human CCK-1 receptors in HEK 293 cells.
Residue:428
BDBM81962
NameBDBM81962
Synonyms:S-L-365,260
Typen/a
Emp. Form.C24H22N4O2
Mol. Mass.398.4571
SMILESCN1c2ccccc2C(=N[C@@H](NC(=O)Nc2cccc(C)c2)C1=O)c1ccccc1