Reaction Details
TargetOxytocin receptor
LigandBDBM50407339
Substrate/Competitorn/a
Meas. Tech.ChEMBL_149198 (CHEMBL762760)
Kd 15±n/a nM
Citation Manning, MCheng, LLKlis, WABalaspiri, LOlma, ASawyer, WHWo, NCChan, WY Effects of a D-Cys6/L-Cys6 interchange in nonselective and selective vasopressin and oxytocin antagonists. J Med Chem38:1762-9 (1995) Oxytocin receptor
Name:Oxytocin receptor
Type:Enzyme Catalytic Domain
Mol. Mass.:42889.28
Organism:RAT
Description:Oxytocin OXTR RAT::P70536
Residue:388
BDBM50407339
NameBDBM50407339
Synonyms:CHEMBL1790307
TypeSmall organic molecule
Emp. Form.C46H68N10O11S2
Mol. Mass.1001.223
SMILESCC[C@H](C)[C@H]1NC(=O)[C@H](Cc2cc3ccccc3[nH]2)NC(=O)CC2(CCCCC2)SSC[C@@H](NC(=O)[C@@H](CC(N)=O)NC(=O)[C@@H](NC1=O)[C@@H](C)O)C(=O)N1CCC[C@H]1C(=O)N[C@@H](CCCN)C(O)=O