Reaction Details
TargetVasopressin V1a receptor
LigandBDBM50407342
Substrate/Competitorn/a
Meas. Tech.ChEMBL_214570 (CHEMBL818695)
Kd 2.4±n/a nM
Citation Manning, MCheng, LLKlis, WABalaspiri, LOlma, ASawyer, WHWo, NCChan, WY Effects of a D-Cys6/L-Cys6 interchange in nonselective and selective vasopressin and oxytocin antagonists. J Med Chem38:1762-9 (1995) Vasopressin V1a receptor
Name:Vasopressin V1a receptor
Type:Enzyme Catalytic Domain
Mol. Mass.:47674.81
Organism:RAT
Description:VASOPRESSIN V1A AVPR1A RAT::P30560
Residue:424
BDBM50407342
NameBDBM50407342
Synonyms:CHEMBL415160
TypeSmall organic molecule
Emp. Form.C52H74N14O12S2
Mol. Mass.1151.361
SMILESCN1[C@@H](Cc2ccc(O)cc2)C(=O)N[C@H](Cc2ccccc2)C(=O)N[C@@H](CCC(N)=O)C(=O)N[C@H](CC(N)=O)C(=O)N[C@@H](CSSC2(CCCCC2)CC1=O)C(=O)N1CCC[C@H]1C(=O)N[C@@H](CCCNC(N)=N)C(=O)NCC(N)=O