Reaction Details
Target5-hydroxytryptamine receptor 2A
LigandBDBM50033437
Substrate/Competitorn/a
Meas. Tech.ChEMBL_2506 (CHEMBL617393)
IC50 7943.28±n/a nM
Citation Street, LJBaker, RDavey, WBGuiblin, ARJelley, RAReeve, AJRoutledge, HSternfeld, FWatt, APBeer, MS Synthesis and serotonergic activity of N,N-dimethyl-2-[5-(1,2,4-triazol-1-ylmethyl)-1H-indol-3-yl]ethylamine and analogues: potent agonists for 5-HT1D receptors. J Med Chem38:1799-810 (1995) 5-hydroxytryptamine receptor 2A
Name:5-hydroxytryptamine receptor 2A
Type:undefined
Mol. Mass.:52607.65
Organism:Homo sapiens (Human)
Description:P28223
Residue:471
BDBM50033437
NameBDBM50033437
Synonyms:CHEMBL905 N,N-dimethyl-2-[5-(1,2,4-triazol-1-ylmethyl)-1H-indol-3-yl]-ethanamine N,N-dimethyl-5-(1H-1,2,4-triazol-1-ylmethyl)-1H-indole-3-ethanamine risatriptan
TypeSmall organic molecule
Emp. Form.C15H19N5
Mol. Mass.269.3449
SMILESCN(C)CCc1c[nH]c2ccc(Cn3cncn3)cc12