Reaction Details
Target5-hydroxytryptamine receptor 1A
LigandBDBM50407356
Substrate/Competitorn/a
Meas. Tech.ChEMBL_1077 (CHEMBL616400)
IC50 25.12±n/a nM
Citation Street, LJBaker, RDavey, WBGuiblin, ARJelley, RAReeve, AJRoutledge, HSternfeld, FWatt, APBeer, MS Synthesis and serotonergic activity of N,N-dimethyl-2-[5-(1,2,4-triazol-1-ylmethyl)-1H-indol-3-yl]ethylamine and analogues: potent agonists for 5-HT1D receptors. J Med Chem38:1799-810 (1995) 5-hydroxytryptamine receptor 1A
Name:5-hydroxytryptamine receptor 1A
Type:n/a
Mol. Mass.:46122.49
Organism:Homo sapiens (Human)
Description:n/a
Residue:422
BDBM50407356
NameBDBM50407356
Synonyms:CHEMBL54265
TypeSmall organic molecule
Emp. Form.C14H17N5
Mol. Mass.255.3183
SMILESCN(C)CCc1c[nH]c2ccc(cc12)-n1cncn1