Reaction Details
TargetAngiotensin-converting enzyme
LigandBDBM50407418
Substrate/Competitorn/a
Meas. Tech.ChEMBL_36008 (CHEMBL858254)
IC50 457088.19±n/a nM
Citation Collantes, ERDunn, WJ Amino acid side chain descriptors for quantitative structure-activity relationship studies of peptide analogues. J Med Chem38:2705-13 (1995) Angiotensin-converting enzyme
Name:Angiotensin-converting enzyme
Type:Enzyme
Mol. Mass.:149709.01
Organism:Homo sapiens (Human)
Description:n/a
Residue:1306
BDBM50407418
NameBDBM50407418
Synonyms:CHEMBL328471
TypeSmall organic molecule
Emp. Form.C9H19N5O3
Mol. Mass.245.2789
SMILESC[C@H](NC(=O)[C@@H](N)CCCNC(N)=N)C(O)=O