Reaction Details
TargetAngiotensin-converting enzyme
LigandBDBM50407421
Substrate/Competitorn/a
Meas. Tech.ChEMBL_36008 (CHEMBL858254)
IC50 1995.26±n/a nM
Citation Collantes, ERDunn, WJ Amino acid side chain descriptors for quantitative structure-activity relationship studies of peptide analogues. J Med Chem38:2705-13 (1995) Angiotensin-converting enzyme
Name:Angiotensin-converting enzyme
Type:Enzyme
Mol. Mass.:149709.01
Organism:Homo sapiens (Human)
Description:n/a
Residue:1306
BDBM50407421
NameBDBM50407421
Synonyms:CHEMBL56923
TypeSmall organic molecule
Emp. Form.C17H23N3O3
Mol. Mass.317.3828
SMILESCC[C@H](C)[C@H](N)C(=O)N[C@@H](Cc1c[nH]c2ccccc12)C(O)=O