Reaction Details
TargetAngiotensin-converting enzyme
LigandBDBM50142287
Substrate/Competitorn/a
Meas. Tech.ChEMBL_36008 (CHEMBL858254)
IC50 52480.75±n/a nM
Citation Collantes, ERDunn, WJ Amino acid side chain descriptors for quantitative structure-activity relationship studies of peptide analogues. J Med Chem38:2705-13 (1995) Angiotensin-converting enzyme
Name:Angiotensin-converting enzyme
Type:Enzyme
Mol. Mass.:149709.01
Organism:Homo sapiens (Human)
Description:n/a
Residue:1306
BDBM50142287
NameBDBM50142287
Synonyms:(S)-2-((S)-2-Amino-3-methyl-butyrylamino)-3-phenyl-propionic acid | CHEMBL8486
TypeSmall organic molecule
Emp. Form.C14H20N2O3
Mol. Mass.264.3202
SMILESCC(C)[C@H](N)C(=O)N[C@@H](Cc1ccccc1)C(O)=O