Reaction Details
TargetAngiotensin-converting enzyme
LigandBDBM50407438
Substrate/Competitorn/a
Meas. Tech.ChEMBL_36008 (CHEMBL858254)
IC50 933254.3±n/a nM
Citation Collantes, ERDunn, WJ Amino acid side chain descriptors for quantitative structure-activity relationship studies of peptide analogues. J Med Chem38:2705-13 (1995) Angiotensin-converting enzyme
Name:Angiotensin-converting enzyme
Type:Enzyme
Mol. Mass.:149709.01
Organism:Homo sapiens (Human)
Description:n/a
Residue:1306
BDBM50407438
NameBDBM50407438
Synonyms:CHEMBL91330
TypeSmall organic molecule
Emp. Form.C15H22N2O3
Mol. Mass.278.3468
SMILESCC[C@H](C)[C@H](N)C(=O)N[C@@H](Cc1ccccc1)C(O)=O