Reaction Details
TargetAngiotensin-converting enzyme
LigandBDBM50188508
Substrate/Competitorn/a
Meas. Tech.ChEMBL_36008 (CHEMBL858254)
IC50 208929.61±n/a nM
Citation Collantes, ERDunn, WJ Amino acid side chain descriptors for quantitative structure-activity relationship studies of peptide analogues. J Med Chem38:2705-13 (1995) Angiotensin-converting enzyme
Name:Angiotensin-converting enzyme
Type:Enzyme
Mol. Mass.:149709.01
Organism:Homo sapiens (Human)
Description:n/a
Residue:1306
BDBM50188508
NameBDBM50188508
Synonyms:(S)-2-(2-Amino-acetylamino)-3-(4-hydroxy-phenyl)-propionic acid CHEMBL53400 | Gly-Tyr
TypeSmall organic molecule
Emp. Form.C11H14N2O4
Mol. Mass.238.2399
SMILESNCC(=O)N[C@@H](Cc1ccc(O)cc1)C(O)=O