Reaction Details
TargetAngiotensin-converting enzyme
LigandBDBM50169222
Substrate/Competitorn/a
Meas. Tech.ChEMBL_36008 (CHEMBL858254)
IC50 7244359.6±n/a nM
Citation Collantes, ERDunn, WJ Amino acid side chain descriptors for quantitative structure-activity relationship studies of peptide analogues. J Med Chem38:2705-13 (1995) Angiotensin-converting enzyme
Name:Angiotensin-converting enzyme
Type:Enzyme
Mol. Mass.:149709.01
Organism:Homo sapiens (Human)
Description:n/a
Residue:1306
BDBM50169222
NameBDBM50169222
Synonyms:2-(aminoacetamido)acetic acid Gly-Gly N-glycylglycine glycine dipeptide | glycylglycine
TypeSmall organic molecule
Emp. Form.C4H8N2O3
Mol. Mass.132.1179
SMILESNCC(=O)NCC(O)=O