Reaction Details
TargetAngiotensin-converting enzyme
LigandBDBM50407446
Substrate/Competitorn/a
Meas. Tech.ChEMBL_36008 (CHEMBL858254)
IC50 128824.96±n/a nM
Citation Collantes, ERDunn, WJ Amino acid side chain descriptors for quantitative structure-activity relationship studies of peptide analogues. J Med Chem38:2705-13 (1995) Angiotensin-converting enzyme
Name:Angiotensin-converting enzyme
Type:Enzyme
Mol. Mass.:149709.01
Organism:Homo sapiens (Human)
Description:n/a
Residue:1306
BDBM50407446
NameBDBM50407446
Synonyms:CHEMBL94119
TypeSmall organic molecule
Emp. Form.C11H20N2O3
Mol. Mass.228.2881
SMILESCC[C@H](C)[C@H](N)C(=O)N1CCC[C@@H]1C(O)=O