Reaction Details
TargetAngiotensin-converting enzyme
LigandBDBM50169210
Substrate/Competitorn/a
Meas. Tech.ChEMBL_36008 (CHEMBL858254)
IC50 2511886.43±n/a nM
Citation Collantes, ERDunn, WJ Amino acid side chain descriptors for quantitative structure-activity relationship studies of peptide analogues. J Med Chem38:2705-13 (1995) Angiotensin-converting enzyme
Name:Angiotensin-converting enzyme
Type:Enzyme
Mol. Mass.:149709.01
Organism:Homo sapiens (Human)
Description:n/a
Residue:1306
BDBM50169210
NameBDBM50169210
Synonyms:((S)-2-Amino-propionylamino)-acetic acid Ala-Gly | CHEMBL94250
TypeSmall organic molecule
Emp. Form.C5H10N2O3
Mol. Mass.146.1445
SMILESC[C@H](N)C(=O)NCC(O)=O