Reaction Details
TargetAngiotensin-converting enzyme
LigandBDBM50188492
Substrate/Competitorn/a
Meas. Tech.ChEMBL_36008 (CHEMBL858254)
IC50 2511886.43±n/a nM
Citation Collantes, ERDunn, WJ Amino acid side chain descriptors for quantitative structure-activity relationship studies of peptide analogues. J Med Chem38:2705-13 (1995) Angiotensin-converting enzyme
Name:Angiotensin-converting enzyme
Type:Enzyme
Mol. Mass.:149709.01
Organism:Homo sapiens (Human)
Description:n/a
Residue:1306
BDBM50188492
NameBDBM50188492
Synonyms:(S)-2-(2-Amino-acetylamino)-4-methyl-pentanoic acid CHEMBL56119 | Gly-Leu
TypeSmall organic molecule
Emp. Form.C8H16N2O3
Mol. Mass.188.2242
SMILESCC(C)C[C@H](NC(=O)CN)C(O)=O