Reaction Details
TargetAngiotensin-converting enzyme
LigandBDBM50188491
Substrate/Competitorn/a
Meas. Tech.ChEMBL_36008 (CHEMBL858254)
IC50 630957.34±n/a nM
Citation Collantes, ERDunn, WJ Amino acid side chain descriptors for quantitative structure-activity relationship studies of peptide analogues. J Med Chem38:2705-13 (1995) Angiotensin-converting enzyme
Name:Angiotensin-converting enzyme
Type:Enzyme
Mol. Mass.:149709.01
Organism:Homo sapiens (Human)
Description:n/a
Residue:1306
BDBM50188491
NameBDBM50188491
Synonyms:(S)-2-(2-Amino-acetylamino)-3-phenyl-propionic acid 2-(2-Amino-acetylamino)-3-phenyl-propionic acid Gly-Phe
TypeSmall organic molecule
Emp. Form.C11H14N2O3
Mol. Mass.222.2405
SMILESNCC(=O)N[C@@H](Cc1ccccc1)C(O)=O