Reaction Details
TargetAngiotensin-converting enzyme
LigandBDBM50169199
Substrate/Competitorn/a
Meas. Tech.ChEMBL_36008 (CHEMBL858254)
IC50 3090295.43±n/a nM
Citation Collantes, ERDunn, WJ Amino acid side chain descriptors for quantitative structure-activity relationship studies of peptide analogues. J Med Chem38:2705-13 (1995) Angiotensin-converting enzyme
Name:Angiotensin-converting enzyme
Type:Enzyme
Mol. Mass.:149709.01
Organism:Homo sapiens (Human)
Description:n/a
Residue:1306
BDBM50169199
NameBDBM50169199
Synonyms:(S)-2-(2-Amino-acetylamino)-3-(3H-imidazol-4-yl)-propionic acid CHEMBL93127 | Gly-His
TypeSmall organic molecule
Emp. Form.C8H12N4O3
Mol. Mass.212.2059
SMILESNCC(=O)N[C@@H](Cc1cnc[nH]1)C(O)=O