Reaction Details
TargetAngiotensin-converting enzyme
LigandBDBM50188485
Substrate/Competitorn/a
Meas. Tech.ChEMBL_36008 (CHEMBL858254)
IC50 10000±n/a nM
Citation Collantes, ERDunn, WJ Amino acid side chain descriptors for quantitative structure-activity relationship studies of peptide analogues. J Med Chem38:2705-13 (1995) Angiotensin-converting enzyme
Name:Angiotensin-converting enzyme
Type:Enzyme
Mol. Mass.:149709.01
Organism:Homo sapiens (Human)
Description:n/a
Residue:1306
BDBM50188485
NameBDBM50188485
Synonyms:(S)-2-((S)-2-Amino-propionylamino)-3-(1H-indol-3-yl)-propionic acid CHEMBL91792
TypeSmall organic molecule
Emp. Form.C14H17N3O3
Mol. Mass.275.3031
SMILESC[C@H](N)C(=O)N[C@@H](Cc1c[nH]c2ccccc12)C(O)=O