Reaction Details
TargetAngiotensin-converting enzyme
LigandBDBM50188523
Substrate/Competitorn/a
Meas. Tech.ChEMBL_36008 (CHEMBL858254)
IC50 87096.36±n/a nM
Citation Collantes, ERDunn, WJ Amino acid side chain descriptors for quantitative structure-activity relationship studies of peptide analogues. J Med Chem38:2705-13 (1995) Angiotensin-converting enzyme
Name:Angiotensin-converting enzyme
Type:Enzyme
Mol. Mass.:149709.01
Organism:Homo sapiens (Human)
Description:n/a
Residue:1306
BDBM50188523
NameBDBM50188523
Synonyms:(S)-2-((S)-2-Amino-propionylamino)-3-(4-hydroxy-phenyl)-propionic acid CHEMBL94016
TypeSmall organic molecule
Emp. Form.C12H16N2O4
Mol. Mass.252.2664
SMILESC[C@H](N)C(=O)N[C@@H](Cc1ccc(O)cc1)C(O)=O