Reaction Details
TargetAngiotensin-converting enzyme
LigandBDBM50407466
Substrate/Competitorn/a
Meas. Tech.ChEMBL_36008 (CHEMBL858254)
IC50 309029.54±n/a nM
Citation Collantes, ERDunn, WJ Amino acid side chain descriptors for quantitative structure-activity relationship studies of peptide analogues. J Med Chem38:2705-13 (1995) Angiotensin-converting enzyme
Name:Angiotensin-converting enzyme
Type:Enzyme
Mol. Mass.:149709.01
Organism:Homo sapiens (Human)
Description:n/a
Residue:1306
BDBM50407466
NameBDBM50407466
Synonyms:CHEMBL541207 | Leu-Ala
TypeSmall organic molecule
Emp. Form.C9H18N2O3
Mol. Mass.202.2508
SMILESCC(C)C[C@H](N)C(=O)N[C@@H](C)C(O)=O