Reaction Details
TargetDihydrofolate reductase
LigandBDBM50407725
Substrate/Competitorn/a
Meas. Tech.ChEMBL_53000 (CHEMBL858265)
Ki 1.86±n/a nM
Citation Marlowe, CKSelassie, CDSanti, DV Quantitative structure-activity relationships of the inhibition of Pneumocystis carinii dihydrofolate reductase by 4,6-diamino-1,2-dihydro-2,2-dimethyl-1-(X-phenyl)-s-triazines. J Med Chem38:967-72 (1995) Dihydrofolate reductase
Name:Dihydrofolate reductase
Type:Enzyme
Mol. Mass.:23891.29
Organism:Pneumocystis carinii
Description:n/a
Residue:206
BDBM50407725
NameBDBM50407725
Synonyms:CHEMBL6666
TypeSmall organic molecule
Emp. Form.C21H25ClN6O2
Mol. Mass.428.915
SMILESCN(C)C(=O)c1cccc(COc2ccc(cc2Cl)N2C(N)=NC(N)=NC2(C)C)c1