Reaction Details
TargetDihydrofolate reductase
LigandBDBM50291791
Substrate/Competitorn/a
Meas. Tech.ChEMBL_53000 (CHEMBL858265)
Ki 5.37±n/a nM
Citation Marlowe, CKSelassie, CDSanti, DV Quantitative structure-activity relationships of the inhibition of Pneumocystis carinii dihydrofolate reductase by 4,6-diamino-1,2-dihydro-2,2-dimethyl-1-(X-phenyl)-s-triazines. J Med Chem38:967-72 (1995) Dihydrofolate reductase
Name:Dihydrofolate reductase
Type:Enzyme
Mol. Mass.:23891.29
Organism:Pneumocystis carinii
Description:n/a
Residue:206
BDBM50291791
NameBDBM50291791
Synonyms:6,6-Dimethyl-1-[3-(naphthalen-1-yloxymethyl)-phenyl]-1,6-dihydro-[1,3,5]triazine-2,4-diamine | CHEMBL20466
TypeSmall organic molecule
Emp. Form.C22H23N5O
Mol. Mass.373.4509
SMILESCC1(C)N=C(N)N=C(N)N1c1cccc(COc2cccc3ccccc23)c1