Reaction Details
TargetDihydrofolate reductase
LigandBDBM50405038
Substrate/Competitorn/a
Meas. Tech.ChEMBL_54290 (CHEMBL858267)
Ki 22.39±n/a nM
Citation Marlowe, CKSelassie, CDSanti, DV Quantitative structure-activity relationships of the inhibition of Pneumocystis carinii dihydrofolate reductase by 4,6-diamino-1,2-dihydro-2,2-dimethyl-1-(X-phenyl)-s-triazines. J Med Chem38:967-72 (1995) Dihydrofolate reductase
Name:Dihydrofolate reductase
Type:Enzyme
Mol. Mass.:21453.99
Organism:Homo sapiens (Human)
Description:Recombinant human DHFR.
Residue:187
BDBM50405038
NameBDBM50405038
Synonyms:CHEMBL33697
TypeSmall organic molecule
Emp. Form.C21H24Cl2FN5O2S
Mol. Mass.500.417
SMILESCC1(C)N=C(N)N=C(N)N1c1ccc(CCCCc2ccc(cc2Cl)S(F)(=O)=O)c(Cl)c1