Reaction Details
Target5-hydroxytryptamine receptor 3A/3B
LigandBDBM50407786
Substrate/Competitorn/a
Meas. Tech.ChEMBL_3458 (CHEMBL618142)
IC50 1.4±n/a nM
Citation Rault, SLancelot, JCPrunier, HRobba, MRenard, PDelagrange, PPfeiffer, BCaignard, DHGuardiola-Lemaitre, BHamon, M Novel selective and partial agonists of 5-HT3 receptors. Part 1. Synthesis and biological evaluation of piperazinopyrrolothienopyrazines. J Med Chem39:2068-80 (1996) 
 
5-hydroxytryptamine receptor 3A/3B
Name:5-hydroxytryptamine receptor 3A/3B
Type:n/a
Mol. Mass.:n/a
Description:ASSAY_ID of EBI is 2974
Components:This complex has 2 components.
Component 1
Name:5-hydroxytryptamine receptor 3B
Synonyms:5HT3B_RAT Serotonin (5-HT) receptor
Type:PROTEIN
Mol. Mass.:50328.78
Organism:Rattus norvegicus
Description:EBI_11885
Residue:437
Component 2
Name:5-hydroxytryptamine receptor 3A
Synonyms:5-HT3 5HT3A_RAT Htr3 Serotonin (5-HT) receptor | Zacopride site-R
Type:Enzyme Catalytic Domain
Mol. Mass.:55428.70
Organism:RAT
Description:5-HT3 HTR3A RAT::P35563
Residue:483
BDBM50407786
NameBDBM50407786
Synonyms:CHEMBL54720
TypeSmall organic molecule
Emp. Form.C20H20N4S
Mol. Mass.348.465
SMILESC(N1CCN(CC1)c1nc2ccsc2n2cccc12)c1ccccc1