Reaction Details
Target5-hydroxytryptamine receptor 2C
LigandBDBM84991
Substrate/Competitorn/a
Meas. Tech.ChEMBL_2774 (CHEMBL858023)
Ki 1514±n/a nM
Citation Audia, JEEvrard, DAMurdoch, GRDroste, JJNissen, JSSchenck, KWFludzinski, PLucaites, VLNelson, DLCohen, ML Potent, selective tetrahydro-beta-carboline antagonists of the serotonin 2B (5HT2B) contractile receptor in the rat stomach fundus. J Med Chem39:2773-80 (1996) 
 
5-hydroxytryptamine receptor 2C
Name:5-hydroxytryptamine receptor 2C
Type:Enzyme
Mol. Mass.:51948.16
Organism:Mus musculus (Mouse)
Description:P34968
Residue:459
BDBM84991
NameBDBM84991
Synonyms:CAS_3277600 SB204741
TypeSmall organic molecule
Emp. Form.C14H14N4OS
Mol. Mass.286.352
SMILESCc1cc(NC(=O)Nc2ccc3n(C)ccc3c2)sn1