Reaction Details
Target5-hydroxytryptamine receptor 2C
LigandBDBM50407854
Substrate/Competitorn/a
Meas. Tech.ChEMBL_2783 (CHEMBL617853)
Ki 0.955±n/a nM
Citation Audia, JEEvrard, DAMurdoch, GRDroste, JJNissen, JSSchenck, KWFludzinski, PLucaites, VLNelson, DLCohen, ML Potent, selective tetrahydro-beta-carboline antagonists of the serotonin 2B (5HT2B) contractile receptor in the rat stomach fundus. J Med Chem39:2773-80 (1996) 
 
5-hydroxytryptamine receptor 2C
Name:5-hydroxytryptamine receptor 2C
Type:Enzyme
Mol. Mass.:51935.10
Organism:Rattus norvegicus (Rat)
Description:P08909
Residue:460
BDBM50407854
NameBDBM50407854
Synonyms:CHEMBL96485
TypeSmall organic molecule
Emp. Form.C23H23FN2
Mol. Mass.346.4405
SMILESCc1ccc2NC3C(CCNC3Cc3cccc4ccccc34)c2c1F