Reaction Details
TargetAcetylcholinesterase
LigandBDBM50039727
Substrate/Competitorn/a
Meas. Tech.ChEMBL_28756 (CHEMBL641020)
IC50 9.4±n/a nM
Citation Tong, WCollantes, ERChen, YWelsh, WJ A comparative molecular field analysis study of N-benzylpiperidines as acetylcholinesterase inhibitors. J Med Chem39:380-7 (1996) 
 
Acetylcholinesterase
Name:Acetylcholinesterase
Type:Enzyme
Mol. Mass.:67792.70
Organism:Homo sapiens (Human)
Description:P22303
Residue:614
BDBM50039727
NameBDBM50039727
Synonyms:CHEMBL93123 N-{3-[2-(1-Benzyl-piperidin-4-yl)-ethyl]-benzo[d]isoxazol-6-yl}-benzamide
TypeSmall organic molecule
Emp. Form.C28H29N3O2
Mol. Mass.439.5488
SMILESO=C(Nc1ccc2c(CCC3CCN(Cc4ccccc4)CC3)noc2c1)c1ccccc1