Reaction Details
TargetAcetylcholinesterase
LigandBDBM50039731
Substrate/Competitorn/a
Meas. Tech.ChEMBL_28756 (CHEMBL641020)
IC50 26±n/a nM
Citation Tong, WCollantes, ERChen, YWelsh, WJ A comparative molecular field analysis study of N-benzylpiperidines as acetylcholinesterase inhibitors. J Med Chem39:380-7 (1996) 
 
Acetylcholinesterase
Name:Acetylcholinesterase
Type:Enzyme
Mol. Mass.:67792.70
Organism:Homo sapiens (Human)
Description:P22303
Residue:614
BDBM50039731
NameBDBM50039731
Synonyms:3-(2-(1-benzylpiperidin-4-yl)ethyl)benzo[d]isoxazol-6-ol CHEMBL92463
TypeSmall organic molecule
Emp. Form.C21H24N2O2
Mol. Mass.336.4275
SMILESOc1ccc2c(CCC3CCN(Cc4ccccc4)CC3)noc2c1