Reaction Details
TargetAcetylcholinesterase
LigandBDBM50004036
Substrate/Competitorn/a
Meas. Tech.ChEMBL_28928 (CHEMBL857056)
IC50 63.97±n/a nM
Citation Tong, WCollantes, ERChen, YWelsh, WJ A comparative molecular field analysis study of N-benzylpiperidines as acetylcholinesterase inhibitors. J Med Chem39:380-7 (1996) 
 
Acetylcholinesterase
Name:Acetylcholinesterase
Type:Enzyme
Mol. Mass.:68165.65
Organism:Mus musculus (mouse)
Description:n/a
Residue:614
BDBM50004036
NameBDBM50004036
Synonyms:CHEMBL340621 N-[2-(1-Benzyl-piperidin-4-yl)-ethyl]-N-phenyl-isonicotinamide
TypeSmall organic molecule
Emp. Form.C26H29N3O
Mol. Mass.399.528
SMILESO=C(N(CCC1CCN(Cc2ccccc2)CC1)c1ccccc1)c1ccncc1