Reaction Details
TargetAcetylcholinesterase
LigandBDBM50039712
Substrate/Competitorn/a
Meas. Tech.ChEMBL_28756 (CHEMBL641020)
IC50 7.19±n/a nM
Citation Tong, WCollantes, ERChen, YWelsh, WJ A comparative molecular field analysis study of N-benzylpiperidines as acetylcholinesterase inhibitors. J Med Chem39:380-7 (1996) 
 
Acetylcholinesterase
Name:Acetylcholinesterase
Type:Enzyme
Mol. Mass.:67792.70
Organism:Homo sapiens (Human)
Description:P22303
Residue:614
BDBM50039712
NameBDBM50039712
Synonyms:3-(2-(1-benzylpiperidin-4-yl)ethyl)-5-methoxybenzo[d]isoxazole CHEMBL94186
TypeSmall organic molecule
Emp. Form.C22H26N2O2
Mol. Mass.350.454
SMILESCOc1ccc2onc(CCC3CCN(Cc4ccccc4)CC3)c2c1