Reaction Details
TargetAcetylcholinesterase
LigandBDBM9405
Substrate/Competitorn/a
Meas. Tech.ChEMBL_28928 (CHEMBL857056)
IC50 169.82±n/a nM
Citation Tong, WCollantes, ERChen, YWelsh, WJ A comparative molecular field analysis study of N-benzylpiperidines as acetylcholinesterase inhibitors. J Med Chem39:380-7 (1996) 
 
Acetylcholinesterase
Name:Acetylcholinesterase
Type:Enzyme
Mol. Mass.:68165.65
Organism:Mus musculus (mouse)
Description:n/a
Residue:614
BDBM9405
NameBDBM9405
Synonyms:CHEMBL56470 N-[2-(1-benzylpiperidin-4-yl)ethyl]-N-methylbenzamide hydrochloride | Piperidine Derivative 13
TypeSmall organic molecule
Emp. Form.C22H28N2O
Mol. Mass.336.4705
SMILESCN(CCC1CCN(Cc2ccccc2)CC1)C(=O)c1ccccc1