Reaction Details
Target5-hydroxytryptamine receptor 2C
LigandBDBM50407993
Substrate/Competitorn/a
Meas. Tech.ChEMBL_2854 (CHEMBL617495)
Ki 7.94±n/a nM
Citation Forbes, ITDabbs, SDuckworth, DMHam, PJones, GEKing, FDSaunders, DVBlaney, FENaylor, CBBaxter, GSBlackburn, TPKennett, GAWood, MD Synthesis, biological activity, and molecular modeling of selective 5-HT(2C/2B) receptor antagonists. J Med Chem39:4966-77 (1997) 
 
5-hydroxytryptamine receptor 2C
Name:5-hydroxytryptamine receptor 2C
Type:Enzyme
Mol. Mass.:51935.10
Organism:Rattus norvegicus (Rat)
Description:P08909
Residue:460
BDBM50407993
NameBDBM50407993
Synonyms:CHEMBL148385
TypeSmall organic molecule
Emp. Form.C18H18N4O
Mol. Mass.306.3617
SMILESCCn1ccc2cc3N(CCc3cc12)C(=O)Nc1cccnc1