Reaction Details
TargetPeptidyl-prolyl cis-trans isomerase FKBP1A
LigandBDBM50408095
Substrate/Competitorn/a
Meas. Tech.ChEMBL_66276 (CHEMBL857528)
Ki 67000±n/a nM
Citation Dragovich, PSBarker, JEFrench, JImbacuan, MKalish, VJKissinger, CRKnighton, DRLewis, CTMoomaw, EWParge, HEPelletier, LAPrins, TJShowalter, RETatlock, JHTucker, KDVillafranca, JE Structure-based design of novel, urea-containing FKBP12 inhibitors. J Med Chem39:1872-84 (1996) 
 
Peptidyl-prolyl cis-trans isomerase FKBP1A
Name:Peptidyl-prolyl cis-trans isomerase FKBP1A
Type:Isomerase
Mol. Mass.:11953.09
Organism:Homo sapiens (Human)
Description:P62942
Residue:108
BDBM50408095
NameBDBM50408095
Synonyms:CHEMBL292166
TypeSmall organic molecule
Emp. Form.C17H22N2O3
Mol. Mass.302.3682
SMILESCOC(=O)[C@@H]1CCC[C@H]2CCN(Cc3ccccc3)C(=O)N12