Reaction Details
TargetPeptidyl-prolyl cis-trans isomerase FKBP1A
LigandBDBM50408096
Substrate/Competitorn/a
Meas. Tech.ChEMBL_66276 (CHEMBL857528)
Ki 350±n/a nM
Citation Dragovich, PSBarker, JEFrench, JImbacuan, MKalish, VJKissinger, CRKnighton, DRLewis, CTMoomaw, EWParge, HEPelletier, LAPrins, TJShowalter, RETatlock, JHTucker, KDVillafranca, JE Structure-based design of novel, urea-containing FKBP12 inhibitors. J Med Chem39:1872-84 (1996) 
 
Peptidyl-prolyl cis-trans isomerase FKBP1A
Name:Peptidyl-prolyl cis-trans isomerase FKBP1A
Type:Isomerase
Mol. Mass.:11953.09
Organism:Homo sapiens (Human)
Description:P62942
Residue:108
BDBM50408096
NameBDBM50408096
Synonyms:CHEMBL301025
TypeSmall organic molecule
Emp. Form.C27H36N2O3
Mol. Mass.436.5863
SMILESCC(C)(C)CNC(=O)N1CCCC[C@H]1C(=O)O[C@H](CCc1ccccc1)c1ccccc1