Reaction Details
TargetPeptidyl-prolyl cis-trans isomerase FKBP1A
LigandBDBM50408101
Substrate/Competitorn/a
Meas. Tech.ChEMBL_66276 (CHEMBL857528)
Ki 370±n/a nM
Citation Dragovich, PSBarker, JEFrench, JImbacuan, MKalish, VJKissinger, CRKnighton, DRLewis, CTMoomaw, EWParge, HEPelletier, LAPrins, TJShowalter, RETatlock, JHTucker, KDVillafranca, JE Structure-based design of novel, urea-containing FKBP12 inhibitors. J Med Chem39:1872-84 (1996) 
 
Peptidyl-prolyl cis-trans isomerase FKBP1A
Name:Peptidyl-prolyl cis-trans isomerase FKBP1A
Type:Isomerase
Mol. Mass.:11953.09
Organism:Homo sapiens (Human)
Description:P62942
Residue:108
BDBM50408101
NameBDBM50408101
Synonyms:CHEMBL293519
TypeSmall organic molecule
Emp. Form.C22H34N2O4
Mol. Mass.390.5164
SMILESCOc1cccc(CCCOC(=O)[C@@H]2CCCCN2C(=O)NCC(C)(C)C)c1