Reaction Details
TargetThymidylate synthase
LigandBDBM50408125
Substrate/Competitorn/a
Meas. Tech.ChEMBL_209984 (CHEMBL821265)
Ki 11±n/a nM
Citation Bavetsias, VJackman, ALMarriott, JHKimbell, RGibson, WBoyle, FTBisset, GM Folate-based inhibitors of thymidylate synthase: synthesis and antitumor activity of gamma-linked sterically hindered dipeptide analogues of 2-desamino-2-methyl-N10-propargyl-5,8-dideazafolic acid (ICI 198583). J Med Chem40:1495-510 (1997) 
 
Thymidylate synthase
Name:Thymidylate synthase
Type:PROTEIN
Mol. Mass.:34957.15
Organism:Mus musculus
Description:ChEMBL_1340097
Residue:307
BDBM50408125
NameBDBM50408125
Synonyms:CHEMBL288615
TypeSmall organic molecule
Emp. Form.C31H33N5O9
Mol. Mass.619.6218
SMILESCN([C@@H](CCC(O)=O)C(O)=O)C(=O)[C@H](CCC(O)=O)NC(=O)c1ccc(cc1)N(CC#C)Cc1ccc2nc(C)[nH]c(=O)c2c1