Reaction Details
Target5-hydroxytryptamine receptor 3A/3B/3C/3D/3E
LigandBDBM50408163
Substrate/Competitorn/a
Meas. Tech.ChEMBL_3456 (CHEMBL618141)
IC50 28±n/a nM
Citation Prunier, HRault, SLancelot, JCRobba, MRenard, PDelagrange, PPfeiffer, BCaignard, DHMisslin, RGuardiola-Lemaitre, BHamon, M Novel and selective partial agonists of 5-HT3 receptors. 2. Synthesis and biological evaluation of piperazinopyridopyrrolopyrazines, piperazinopyrroloquinoxalines, and piperazinopyridopyrroloquinoxalines. J Med Chem40:1808-19 (1997) 
 
5-hydroxytryptamine receptor 3A/3B/3C/3D/3E
Name:5-hydroxytryptamine receptor 3A/3B/3C/3D/3E
Type:n/a
Mol. Mass.:n/a
Description:ASSAY_ID of EBI is 3422
Components:This complex has 5 components.
Component 1
Name:5-hydroxytryptamine receptor 3A
Synonyms:5-HT-3 5-HT3A 5-hydroxytryptamine receptor 3 (5-HT3) 5-hydroxytryptamine receptor 3A (5HT3A) 5HT3R HTR3A Serotonin 3 receptor (5HT3) Serotonin-gated ion channel receptor | Serotonin-gated ion channel receptor 3
Type:Protein
Mol. Mass.:55283.27
Organism:Homo sapiens (Human)
Description:P46098
Residue:478
Component 2
Name:5-hydroxytryptamine receptor 3B
Synonyms:5-HT-3B 5-hydroxytryptamine receptor 3B HTR3B Serotonin receptor 3B
Type:PROTEIN
Mol. Mass.:50281.60
Organism:Homo sapiens (Human)
Description:EBI_11305
Residue:441
Component 3
Name:5-hydroxytryptamine receptor 3C
Synonyms:5HT3C_HUMAN Serotonin (5-HT3) receptor
Type:PROTEIN
Mol. Mass.:50216.00
Organism:Homo sapiens (Human)
Description:EBI_12117
Residue:447
Component 4
Name:5-hydroxytryptamine receptor 3D
Synonyms:5HT3D_HUMAN Serotonin (5-HT3) receptor
Type:PROTEIN
Mol. Mass.:50209.16
Organism:Homo sapiens (Human)
Description:EBI_12960
Residue:454
Component 5
Name:5-hydroxytryptamine receptor 3E
Synonyms:5HT3E_HUMAN Serotonin (5-HT3) receptor
Type:PROTEIN
Mol. Mass.:51440.34
Organism:Homo sapiens (Human)
Description:EBI_14002
Residue:456
BDBM50408163
NameBDBM50408163
Synonyms:CHEMBL52867
TypeSmall organic molecule
Emp. Form.C26H23N5O2
Mol. Mass.437.4931
SMILESC(N1CCN(CC1)c1nc2ccc3ncccc3c2n2cccc12)c1ccc2OCOc2c1