Reaction Details
TargetD(2) dopamine receptor
LigandBDBM50408236
Substrate/Competitorn/a
Meas. Tech.ChEMBL_61316 (CHEMBL670091)
Ki 6700±n/a nM
Citation Elworthy, TRFord, APBantle, GWMorgans, DJOzer, RSPalmer, WSRepke, DBRomero, MSandoval, LSjogren, EBTalamás, FXVazquez, AWu, HArredondo, NFBlue, DRDeSousa, AGross, LMKava, MSLesnick, JDVimont, RLWilliams, TJZhu, QMPfister, JRClarke, DE N-arylpiperazinyl-N'-propylamino derivatives of heteroaryl amides as functional uroselective alpha 1-adrenoceptor antagonists. J Med Chem40:2674-87 (1997) 
 
D(2) dopamine receptor
Name:D(2) dopamine receptor
Type:Cell-surface receptors
Mol. Mass.:50647.10
Organism:Homo sapiens (Human)
Description:P14416
Residue:443
BDBM50408236
NameBDBM50408236
Synonyms:CHEMBL420620
TypeSmall organic molecule
Emp. Form.C22H30FN5O2
Mol. Mass.415.5043
SMILESCOc1cc(F)ccc1N1CCN(CCCNc2ncccc2C(=O)N(C)C)CC1