Reaction Details
Target5-hydroxytryptamine receptor 1A
LigandBDBM50408199
Substrate/Competitorn/a
Meas. Tech.ChEMBL_1582 (CHEMBL616993)
Ki 7500±n/a nM
Citation Elworthy, TRFord, APBantle, GWMorgans, DJOzer, RSPalmer, WSRepke, DBRomero, MSandoval, LSjogren, EBTalamás, FXVazquez, AWu, HArredondo, NFBlue, DRDeSousa, AGross, LMKava, MSLesnick, JDVimont, RLWilliams, TJZhu, QMPfister, JRClarke, DE N-arylpiperazinyl-N'-propylamino derivatives of heteroaryl amides as functional uroselective alpha 1-adrenoceptor antagonists. J Med Chem40:2674-87 (1997) 
 
5-hydroxytryptamine receptor 1A
Name:5-hydroxytryptamine receptor 1A
Type:Enzyme
Mol. Mass.:46192.09
Organism:Mus musculus (Mouse)
Description:Q64264
Residue:421
BDBM50408199
NameBDBM50408199
Synonyms:CHEMBL88160
TypeSmall organic molecule
Emp. Form.C26H34F3N7O2
Mol. Mass.533.5891
SMILESCN(C)C(=O)c1cnc2n(C)nc(C)c2c1NCCCN1CCN(CC1)c1ccccc1OCC(F)(F)F