Reaction Details
TargetAlpha-1A adrenergic receptor
LigandBDBM50033111
Substrate/Competitorn/a
Meas. Tech.ChEMBL_33595 (CHEMBL652804)
Ki 2.5±n/a nM
Citation Elworthy, TRFord, APBantle, GWMorgans, DJOzer, RSPalmer, WSRepke, DBRomero, MSandoval, LSjogren, EBTalamás, FXVazquez, AWu, HArredondo, NFBlue, DRDeSousa, AGross, LMKava, MSLesnick, JDVimont, RLWilliams, TJZhu, QMPfister, JRClarke, DE N-arylpiperazinyl-N'-propylamino derivatives of heteroaryl amides as functional uroselective alpha 1-adrenoceptor antagonists. J Med Chem40:2674-87 (1997) 
 
Alpha-1A adrenergic receptor
Name:Alpha-1A adrenergic receptor
Type:Enzyme Catalytic Domain
Mol. Mass.:51492.08
Organism:CALF
Description:adrenergic Alpha1 0 CALF
Residue:466
BDBM50033111
NameBDBM50033111
Synonyms:1-(4-Amino-6,7-dimethoxy-2-quinazolinyl)-4-((tetrahydro-2-furanyl)carbonyl)piperazine CHEMBL611 Terazosine
TypeSmall organic molecule
Emp. Form.C19H25N5O4
Mol. Mass.387.4329
SMILESCOc1cc2nc(nc(N)c2cc1OC)N1CCN(CC1)C(=O)C1CCCO1