Reaction Details
TargetAlpha-1A adrenergic receptor
LigandBDBM50408208
Substrate/Competitorn/a
Meas. Tech.ChEMBL_33595 (CHEMBL652804)
Ki 1.6±n/a nM
Citation Elworthy, TRFord, APBantle, GWMorgans, DJOzer, RSPalmer, WSRepke, DBRomero, MSandoval, LSjogren, EBTalamás, FXVazquez, AWu, HArredondo, NFBlue, DRDeSousa, AGross, LMKava, MSLesnick, JDVimont, RLWilliams, TJZhu, QMPfister, JRClarke, DE N-arylpiperazinyl-N'-propylamino derivatives of heteroaryl amides as functional uroselective alpha 1-adrenoceptor antagonists. J Med Chem40:2674-87 (1997) 
 
Alpha-1A adrenergic receptor
Name:Alpha-1A adrenergic receptor
Type:Enzyme Catalytic Domain
Mol. Mass.:51492.08
Organism:CALF
Description:adrenergic Alpha1 0 CALF
Residue:466
BDBM50408208
NameBDBM50408208
Synonyms:CHEMBL88820
TypeSmall organic molecule
Emp. Form.C23H30N4O3
Mol. Mass.410.5093
SMILESCOc1ccccc1N1CCN(CCC(=O)Nc2ccccc2C(=O)N(C)C)CC1