Reaction Details
TargetAngiotensin-converting enzyme
LigandBDBM50367879
Substrate/Competitorn/a
Meas. Tech.ChEMBL_35981 (CHEMBL646945)
IC50 3.98±n/a nM
Citation Crippen, GM Validation of EGSITE2, a mixed integer program for deducing objective site models for experimental binding data. J Med Chem40:3161-72 (1997) 
 
Angiotensin-converting enzyme
Name:Angiotensin-converting enzyme
Type:Enzyme
Mol. Mass.:149709.01
Organism:Homo sapiens (Human)
Description:n/a
Residue:1306
BDBM50367879
NameBDBM50367879
Synonyms:LISINOPRIL
TypeSmall organic molecule
Emp. Form.C21H31N3O5
Mol. Mass.405.4879
SMILESNCCCC[C@H](N[C@@H](CCc1ccccc1)C(O)=O)C(=O)N1CCC[C@H]1C(O)=O