Reaction Details
TargetD(3) dopamine receptor
LigandBDBM50408392
Substrate/Competitorn/a
Meas. Tech.ChEMBL_62439 (CHEMBL858764)
Ki 79.43±n/a nM
Citation Nilsson, JWikström, HSmilde, AGlase, SPugsley, TCruciani, GPastor, MClementi, S GRID/GOLPE 3D quantitative structure-activity relationship study on a set of benzamides and naphthamides, with affinity for the dopamine D3 receptor subtype. J Med Chem40:833-40 (1997) 
 
D(3) dopamine receptor
Name:D(3) dopamine receptor
Type:n/a
Mol. Mass.:44243.43
Organism:Homo sapiens (Human)
Description:n/a
Residue:400
BDBM50408392
NameBDBM50408392
Synonyms:CHEMBL166557
TypeSmall organic molecule
Emp. Form.C26H30BrN3O3
Mol. Mass.512.439
SMILESCCOc1c(cc(Br)c2ccccc12)C(=O)NCCN1CCN(CC1)c1ccccc1OC