Reaction Details
TargetD(3) dopamine receptor
LigandBDBM50287169
Substrate/Competitorn/a
Meas. Tech.ChEMBL_62439 (CHEMBL858764)
Ki 251.19±n/a nM
Citation Nilsson, JWikström, HSmilde, AGlase, SPugsley, TCruciani, GPastor, MClementi, S GRID/GOLPE 3D quantitative structure-activity relationship study on a set of benzamides and naphthamides, with affinity for the dopamine D3 receptor subtype. J Med Chem40:833-40 (1997) 
 
D(3) dopamine receptor
Name:D(3) dopamine receptor
Type:n/a
Mol. Mass.:44243.43
Organism:Homo sapiens (Human)
Description:n/a
Residue:400
BDBM50287169
NameBDBM50287169
Synonyms:4-Bromo-1-methoxy-naphthalene-2-carboxylic acid [2-(4-p-tolyl-piperazin-1-yl)-ethyl]-amide | CHEMBL29610
TypeSmall organic molecule
Emp. Form.C25H28BrN3O2
Mol. Mass.482.413
SMILESCOc1c(cc(Br)c2ccccc12)C(=O)NCCN1CCN(CC1)c1ccc(C)cc1