Reaction Details
TargetMuscarinic acetylcholine receptor M4
LigandBDBM50408529
Substrate/Competitorn/a
Meas. Tech.ChEMBL_139256 (CHEMBL745529)
Ki 36±n/a nM
Citation Bolognesi, MLMinarini, ABudriesi, RCacciaguerra, SChiarini, ASpampinato, STumiatti, VMelchiorre, C Universal template approach to drug design: polyamines as selective muscarinic receptor antagonists. J Med Chem41:4150-60 (1998) 
 
Muscarinic acetylcholine receptor M4
Name:Muscarinic acetylcholine receptor M4
Type:Enzyme Catalytic Domain
Mol. Mass.:52841.70
Organism:RAT
Description:Cholinergic, muscarinic M4 CHRM4 RAT::P08485
Residue:477
BDBM50408529
NameBDBM50408529
Synonyms:CHEMBL1202001
TypeSmall organic molecule
Emp. Form.C50H68N10O4
Mol. Mass.873.1395
SMILESCN(CCCCCCCCN(C)CCCCCCNCC(=O)N1c2ccccc2NC(=O)c2cccnc12)CCCCCCNCC(=O)N1c2ccccc2NC(=O)c2cccnc12