Reaction Details
TargetMuscarinic acetylcholine receptor M4
LigandBDBM50408530
Substrate/Competitorn/a
Meas. Tech.ChEMBL_139256 (CHEMBL745529)
Ki 42±n/a nM
Citation Bolognesi, MLMinarini, ABudriesi, RCacciaguerra, SChiarini, ASpampinato, STumiatti, VMelchiorre, C Universal template approach to drug design: polyamines as selective muscarinic receptor antagonists. J Med Chem41:4150-60 (1998) 
 
Muscarinic acetylcholine receptor M4
Name:Muscarinic acetylcholine receptor M4
Type:Enzyme Catalytic Domain
Mol. Mass.:52841.70
Organism:RAT
Description:Cholinergic, muscarinic M4 CHRM4 RAT::P08485
Residue:477
BDBM50408530
NameBDBM50408530
Synonyms:CHEMBL1202003
TypeSmall organic molecule
Emp. Form.C67H80N10O6
Mol. Mass.1121.4155
SMILESCN(CCCCCCCCN(C)CCCCCCN(CC(=O)N1c2ccccc2NC(=O)c2ccccc12)CC(=O)N1c2ccccc2NC(=O)c2ccccc12)CCCCCCNCC(=O)N1c2ccccc2NC(=O)c2ccccc12