Reaction Details
TargetMuscarinic acetylcholine receptor M1
LigandBDBM50408540
Substrate/Competitorn/a
Meas. Tech.ChEMBL_139096 (CHEMBL744272)
Ki 316±n/a nM
Citation Bolognesi, MLMinarini, ABudriesi, RCacciaguerra, SChiarini, ASpampinato, STumiatti, VMelchiorre, C Universal template approach to drug design: polyamines as selective muscarinic receptor antagonists. J Med Chem41:4150-60 (1998) 
 
Muscarinic acetylcholine receptor M1
Name:Muscarinic acetylcholine receptor M1
Type:Enzyme Catalytic Domain
Mol. Mass.:51390.46
Organism:RAT
Description:P08482
Residue:460
BDBM50408540
NameBDBM50408540
Synonyms:CHEMBL335115
TypeSmall organic molecule
Emp. Form.C36H55N7O4
Mol. Mass.649.8664
SMILESCN(CCCCCCCCN(C)C(=O)CCCCCNCC(=O)N1c2ccccc2C(=O)Nc2cccnc12)C(=O)CCCCCN