Reaction Details
TargetMuscarinic acetylcholine receptor M2
LigandBDBM50407222
Substrate/Competitorn/a
Meas. Tech.ChEMBL_138172 (CHEMBL858421)
Ki 7.8±n/a nM
Citation Bolognesi, MLMinarini, ABudriesi, RCacciaguerra, SChiarini, ASpampinato, STumiatti, VMelchiorre, C Universal template approach to drug design: polyamines as selective muscarinic receptor antagonists. J Med Chem41:4150-60 (1998) 
 
Muscarinic acetylcholine receptor M2
Name:Muscarinic acetylcholine receptor M2
Type:Enzyme Catalytic Domain
Mol. Mass.:51555.53
Organism:RAT
Description:P10980
Residue:466
BDBM50407222
NameBDBM50407222
Synonyms:CHEMBL112244
TypeSmall organic molecule
Emp. Form.C36H59N7O2
Mol. Mass.621.8994
SMILESCN(CCCCCCN)CCCCCCCCN(C)CCCCCCNCC(=O)N1c2ccccc2C(=O)Nc2cccnc12