Reaction Details
TargetMuscarinic acetylcholine receptor M2
LigandBDBM50408527
Substrate/Competitorn/a
Meas. Tech.ChEMBL_138172 (CHEMBL858421)
Ki 0.56±n/a nM
Citation Bolognesi, MLMinarini, ABudriesi, RCacciaguerra, SChiarini, ASpampinato, STumiatti, VMelchiorre, C Universal template approach to drug design: polyamines as selective muscarinic receptor antagonists. J Med Chem41:4150-60 (1998) 
 
Muscarinic acetylcholine receptor M2
Name:Muscarinic acetylcholine receptor M2
Type:Enzyme Catalytic Domain
Mol. Mass.:51555.53
Organism:RAT
Description:P10980
Residue:466
BDBM50408527
NameBDBM50408527
Synonyms:CHEMBL1202004
TypeSmall organic molecule
Emp. Form.C52H70N8O4
Mol. Mass.871.1634
SMILESCN(CCCCCCCCN(C)CCCCCCNCC(=O)N1c2ccccc2NC(=O)c2ccccc12)CCCCCCNCC(=O)N1c2ccccc2NC(=O)c2ccccc12