Reaction Details
TargetMuscarinic acetylcholine receptor M2
LigandBDBM50408525
Substrate/Competitorn/a
Meas. Tech.ChEMBL_138172 (CHEMBL858421)
Ki 0.91±n/a nM
Citation Bolognesi, MLMinarini, ABudriesi, RCacciaguerra, SChiarini, ASpampinato, STumiatti, VMelchiorre, C Universal template approach to drug design: polyamines as selective muscarinic receptor antagonists. J Med Chem41:4150-60 (1998) 
 
Muscarinic acetylcholine receptor M2
Name:Muscarinic acetylcholine receptor M2
Type:Enzyme Catalytic Domain
Mol. Mass.:51555.53
Organism:RAT
Description:P10980
Residue:466
BDBM50408525
NameBDBM50408525
Synonyms:CHEMBL1202000
TypeSmall organic molecule
Emp. Form.C64H77N13O6
Mol. Mass.1124.3797
SMILESCN(CCCCCCCCN(C)CCCCCCN(CC(=O)N1c2ccccc2NC(=O)c2cccnc12)CC(=O)N1c2ccccc2NC(=O)c2cccnc12)CCCCCCNCC(=O)N1c2ccccc2NC(=O)c2cccnc12